Information card for entry 7701099
Formula | C79 H58 Au B2 Cl4 F33 N3 P |
Calculated formula | C79 H58 Au B2 Cl4 F33 N3 P |
Title of publication | Imidazolyl-phenyl (IMP) anions: a modular structure for tuning solubility and coordinating ability. |
Authors of publication | Wozniak, Derek I.; Hicks, Andrew J.; Sabbers, William A.; Dobereiner, Graham E. |
Journal of publication | Dalton transactions (Cambridge, England : 2003) |
Year of publication | 2019 |
Journal volume | 48 |
Journal issue | 37 |
Pages of publication | 14138 - 14155 |
a | 11.2277 ± 0.0011 Å |
b | 21.034 ± 0.002 Å |
c | 17.164 ± 0.0018 Å |
α | 90° |
β | 98.416 ± 0.002° |
γ | 90° |
Cell volume | 4009.9 ± 0.7 Å3 |
Cell temperature | 100 ± 2 K |
Ambient diffraction temperature | 99.95 K |
Number of distinct elements | 8 |
Space group number | 4 |
Hermann-Mauguin space group symbol | P 1 21 1 |
Hall space group symbol | P 2yb |
Residual factor for all reflections | 0.0561 |
Residual factor for significantly intense reflections | 0.0361 |
Weighted residual factors for significantly intense reflections | 0.0692 |
Weighted residual factors for all reflections included in the refinement | 0.076 |
Goodness-of-fit parameter for all reflections included in the refinement | 0.79 |
Diffraction radiation wavelength | 0.71073 Å |
Diffraction radiation type | MoKα |