Information card for entry 7701121
Formula | F3 N3 O9 Rb3 Sb |
Calculated formula | F3 N3 O9 Rb3 Sb |
Title of publication | Rb<sub>3</sub>SbF<sub>3</sub>(NO<sub>3</sub>)<sub>3</sub>: an excellent antimony nitrate nonlinear optical material with a strong second harmonic generation response fabricated by a rational multi-component design. |
Authors of publication | Wang, Lei; Yang, Fei; Zhao, Xiaoyu; Huang, Ling; Gao, Daojiang; Bi, Jian; Wang, Xin; Zou, Guohong |
Journal of publication | Dalton transactions (Cambridge, England : 2003) |
Year of publication | 2019 |
Journal volume | 48 |
Journal issue | 40 |
Pages of publication | 15144 - 15150 |
a | 8.9848 ± 0.0011 Å |
b | 7.3395 ± 0.0008 Å |
c | 9.5296 ± 0.0009 Å |
α | 90° |
β | 101.101 ± 0.004° |
γ | 90° |
Cell volume | 616.66 ± 0.12 Å3 |
Cell temperature | 150 ± 2 K |
Ambient diffraction temperature | 150 ± 2 K |
Number of distinct elements | 5 |
Space group number | 4 |
Hermann-Mauguin space group symbol | P 1 21 1 |
Hall space group symbol | P 2yb |
Residual factor for all reflections | 0.0314 |
Residual factor for significantly intense reflections | 0.0274 |
Weighted residual factors for significantly intense reflections | 0.0632 |
Weighted residual factors for all reflections included in the refinement | 0.0674 |
Goodness-of-fit parameter for all reflections included in the refinement | 1.023 |
Diffraction radiation wavelength | 0.71073 Å |
Diffraction radiation type | MoKα |