Information card for entry 7701122
Formula | C4 H7 N9 O3 |
Calculated formula | C4 H7 N9 O3 |
Title of publication | Versatile functionalization of 3,5-diamino-4-nitropyrazole for promising insensitive energetic compounds. |
Authors of publication | Tang, Yongxing; Ma, Jinchao; Imler, Gregory H.; Parrish, Damon A.; Shreeve, Jean'ne M. |
Journal of publication | Dalton transactions (Cambridge, England : 2003) |
Year of publication | 2019 |
Journal volume | 48 |
Journal issue | 38 |
Pages of publication | 14490 - 14496 |
a | 9.1165 ± 0.0004 Å |
b | 14.3444 ± 0.0006 Å |
c | 7.2327 ± 0.0003 Å |
α | 90° |
β | 108.033 ± 0.002° |
γ | 90° |
Cell volume | 899.36 ± 0.07 Å3 |
Cell temperature | 293 ± 2 K |
Ambient diffraction temperature | 293 ± 2 K |
Number of distinct elements | 4 |
Space group number | 14 |
Hermann-Mauguin space group symbol | P 1 21/c 1 |
Hall space group symbol | -P 2ybc |
Residual factor for all reflections | 0.0827 |
Residual factor for significantly intense reflections | 0.0465 |
Weighted residual factors for significantly intense reflections | 0.106 |
Weighted residual factors for all reflections included in the refinement | 0.1222 |
Goodness-of-fit parameter for all reflections included in the refinement | 1.018 |
Diffraction radiation wavelength | 0.71073 Å |
Diffraction radiation type | MoKα |