Information card for entry 7701125
Formula | C26 H36 Cl2 Ga N3 P2 |
Calculated formula | C26 H36 Cl2 Ga N3 P2 |
Title of publication | Synthesis, structure, and reactivity of pincer-type iridium complexes having gallyl- and indyl-metalloligands utilizing 2,5-bis(6-phosphino-2-pyridyl)pyrrolide as a new scaffold for metal-metal bonds. |
Authors of publication | Takaya, Jun; Hoshino, Mayuko; Ueki, Kanako; Saito, Narumasa; Iwasawa, Nobuharu |
Journal of publication | Dalton transactions (Cambridge, England : 2003) |
Year of publication | 2019 |
Journal volume | 48 |
Journal issue | 39 |
Pages of publication | 14606 - 14610 |
a | 14.651 ± 0.003 Å |
b | 13.197 ± 0.003 Å |
c | 16.277 ± 0.004 Å |
α | 90° |
β | 115.211 ± 0.003° |
γ | 90° |
Cell volume | 2847.4 ± 1.1 Å3 |
Cell temperature | 293 ± 2 K |
Ambient diffraction temperature | 293 ± 2 K |
Number of distinct elements | 6 |
Space group number | 14 |
Hermann-Mauguin space group symbol | P 1 21/c 1 |
Hall space group symbol | -P 2ybc |
Residual factor for all reflections | 0.0711 |
Residual factor for significantly intense reflections | 0.0528 |
Weighted residual factors for significantly intense reflections | 0.126 |
Weighted residual factors for all reflections included in the refinement | 0.1416 |
Goodness-of-fit parameter for all reflections included in the refinement | 1.077 |
Diffraction radiation wavelength | 0.71075 Å |
Diffraction radiation type | MoKα |