Information card for entry 7701126
Formula | C26 H36 Cl3 Ga Ir N3 P2 |
Calculated formula | C26 H36 Cl3 Ga Ir N3 P2 |
Title of publication | Synthesis, structure, and reactivity of pincer-type iridium complexes having gallyl- and indyl-metalloligands utilizing 2,5-bis(6-phosphino-2-pyridyl)pyrrolide as a new scaffold for metal-metal bonds. |
Authors of publication | Takaya, Jun; Hoshino, Mayuko; Ueki, Kanako; Saito, Narumasa; Iwasawa, Nobuharu |
Journal of publication | Dalton transactions (Cambridge, England : 2003) |
Year of publication | 2019 |
Journal volume | 48 |
Journal issue | 39 |
Pages of publication | 14606 - 14610 |
a | 11.6099 ± 0.0001 Å |
b | 15.9873 ± 0.0002 Å |
c | 15.7952 ± 0.0002 Å |
α | 90° |
β | 91.647 ± 0.001° |
γ | 90° |
Cell volume | 2930.55 ± 0.06 Å3 |
Cell temperature | 293 ± 2 K |
Ambient diffraction temperature | 293 ± 2 K |
Number of distinct elements | 7 |
Space group number | 14 |
Hermann-Mauguin space group symbol | P 1 21/c 1 |
Hall space group symbol | -P 2ybc |
Residual factor for all reflections | 0.0385 |
Residual factor for significantly intense reflections | 0.0361 |
Weighted residual factors for significantly intense reflections | 0.0947 |
Weighted residual factors for all reflections included in the refinement | 0.0969 |
Goodness-of-fit parameter for all reflections included in the refinement | 1.041 |
Diffraction radiation wavelength | 1.54184 Å |
Diffraction radiation type | CuKα |