Information card for entry 7701165
Formula | C18 K N2 O7 V |
Calculated formula | C18 K N2 O7 V |
Title of publication | Three peroxidovanadium(v) compounds mediated by transition metal cations for enhanced anticancer activity. |
Authors of publication | Chen, Fanghui; Gao, Zhiguo; You, Chaoqun; Wu, Hongshuai; Li, Yaojia; He, Xiaotong; Zhang, Yuchen; Zhang, Yaan; Sun, Baiwang |
Journal of publication | Dalton transactions (Cambridge, England : 2003) |
Year of publication | 2019 |
Journal volume | 48 |
Journal issue | 40 |
Pages of publication | 15160 - 15169 |
a | 7.036 ± 0.0005 Å |
b | 5.8774 ± 0.0005 Å |
c | 12.6598 ± 0.0009 Å |
α | 90° |
β | 90.168 ± 0.007° |
γ | 90° |
Cell volume | 523.52 ± 0.07 Å3 |
Cell temperature | 100 ± 0.1 K |
Ambient diffraction temperature | 100 ± 0.1 K |
Number of distinct elements | 5 |
Space group number | 11 |
Hermann-Mauguin space group symbol | P 1 21/m 1 |
Hall space group symbol | -P 2yb |
Residual factor for all reflections | 0.1561 |
Residual factor for significantly intense reflections | 0.1476 |
Weighted residual factors for significantly intense reflections | 0.3932 |
Weighted residual factors for all reflections included in the refinement | 0.3987 |
Goodness-of-fit parameter for all reflections included in the refinement | 1.2 |
Diffraction radiation probe | x-ray |
Diffraction radiation wavelength | 0.71073 Å |
Diffraction radiation type | MoKα |