Information card for entry 7701168
Formula | C34 H41 Co O10 |
Calculated formula | C34 H41 Co O10 |
Title of publication | When cobalt-mediated [2 + 2 + 2] cycloaddition reaction dares go astray: synthesis of unprecedented cobalt(iii)-complexes. |
Authors of publication | Delorme, Marion; Punter, Alexander; Oliveira, Raquel; Aubert, Corinne; Carissan, Yannick; Parrain, Jean-Luc; Amatore, Muriel; Nava, Paola; Commeiras, Laurent |
Journal of publication | Dalton transactions (Cambridge, England : 2003) |
Year of publication | 2019 |
Journal volume | 48 |
Journal issue | 42 |
Pages of publication | 15767 - 15771 |
a | 15.7927 ± 0.0004 Å |
b | 14.8334 ± 0.0003 Å |
c | 13.6445 ± 0.0003 Å |
α | 90° |
β | 95.503 ± 0.002° |
γ | 90° |
Cell volume | 3181.62 ± 0.13 Å3 |
Cell temperature | 293 K |
Ambient diffraction temperature | 293 K |
Number of distinct elements | 4 |
Space group number | 14 |
Hermann-Mauguin space group symbol | P 1 21/c 1 |
Hall space group symbol | -P 2ybc |
Residual factor for all reflections | 0.0619 |
Residual factor for significantly intense reflections | 0.0463 |
Weighted residual factors for significantly intense reflections | 0.1212 |
Weighted residual factors for all reflections included in the refinement | 0.1346 |
Goodness-of-fit parameter for all reflections included in the refinement | 1.021 |
Diffraction radiation probe | x-ray |
Diffraction radiation wavelength | 0.71073 Å |
Diffraction radiation type | MoKα |