Information card for entry 7701169
Formula | C28 H33 Co O6 |
Calculated formula | C28 H33 Co O6 |
Title of publication | When cobalt-mediated [2 + 2 + 2] cycloaddition reaction dares go astray: synthesis of unprecedented cobalt(iii)-complexes. |
Authors of publication | Delorme, Marion; Punter, Alexander; Oliveira, Raquel; Aubert, Corinne; Carissan, Yannick; Parrain, Jean-Luc; Amatore, Muriel; Nava, Paola; Commeiras, Laurent |
Journal of publication | Dalton transactions (Cambridge, England : 2003) |
Year of publication | 2019 |
Journal volume | 48 |
Journal issue | 42 |
Pages of publication | 15767 - 15771 |
a | 14.17346 ± 0.00017 Å |
b | 15.23444 ± 0.00016 Å |
c | 11.72199 ± 0.00015 Å |
α | 90° |
β | 105.297 ± 0.0013° |
γ | 90° |
Cell volume | 2441.39 ± 0.05 Å3 |
Cell temperature | 293 ± 2 K |
Ambient diffraction temperature | 293 ± 2 K |
Number of distinct elements | 4 |
Space group number | 14 |
Hermann-Mauguin space group symbol | P 1 21/c 1 |
Hall space group symbol | -P 2ybc |
Residual factor for all reflections | 0.0336 |
Residual factor for significantly intense reflections | 0.0309 |
Weighted residual factors for significantly intense reflections | 0.0812 |
Weighted residual factors for all reflections included in the refinement | 0.0829 |
Goodness-of-fit parameter for all reflections included in the refinement | 1.054 |
Diffraction radiation probe | x-ray |
Diffraction radiation wavelength | 1.54184 Å |
Diffraction radiation type | CuKα |