Information card for entry 7701170
Formula | C36 H41 Co N2 O8 S |
Calculated formula | C36 H41 Co N2 O8 S |
Title of publication | When cobalt-mediated [2 + 2 + 2] cycloaddition reaction dares go astray: synthesis of unprecedented cobalt(iii)-complexes. |
Authors of publication | Delorme, Marion; Punter, Alexander; Oliveira, Raquel; Aubert, Corinne; Carissan, Yannick; Parrain, Jean-Luc; Amatore, Muriel; Nava, Paola; Commeiras, Laurent |
Journal of publication | Dalton transactions (Cambridge, England : 2003) |
Year of publication | 2019 |
Journal volume | 48 |
Journal issue | 42 |
Pages of publication | 15767 - 15771 |
a | 9.07112 ± 0.00012 Å |
b | 14.17053 ± 0.00018 Å |
c | 26.6353 ± 0.0004 Å |
α | 90° |
β | 93.3497 ± 0.0012° |
γ | 90° |
Cell volume | 3417.92 ± 0.08 Å3 |
Cell temperature | 293 K |
Ambient diffraction temperature | 293 K |
Number of distinct elements | 6 |
Space group number | 14 |
Hermann-Mauguin space group symbol | P 1 21/c 1 |
Hall space group symbol | -P 2ybc |
Residual factor for all reflections | 0.0447 |
Residual factor for significantly intense reflections | 0.0397 |
Weighted residual factors for significantly intense reflections | 0.1085 |
Weighted residual factors for all reflections included in the refinement | 0.113 |
Goodness-of-fit parameter for all reflections included in the refinement | 1.025 |
Diffraction radiation probe | x-ray |
Diffraction radiation wavelength | 1.54184 Å |
Diffraction radiation type | CuKα |