Information card for entry 7701180
Common name | [CuL40cBr] |
Formula | C15 H19 Br Cu N2 O4 |
Calculated formula | C15 H19 Br Cu N2 O4 |
Title of publication | Copper(ii) complexes with tridentate Schiff base-like ligands: solid state and solution structures and anticancer activity. |
Authors of publication | Dankhoff, Katja; Gold, Madeleine; Kober, Luisa; Schmitt, Florian; Pfeifer, Lena; Dürrmann, Andreas; Kostrhunova, Hana; Rothemund, Matthias; Brabec, Viktor; Schobert, Rainer; Weber, Birgit |
Journal of publication | Dalton transactions (Cambridge, England : 2003) |
Year of publication | 2019 |
Journal volume | 48 |
Journal issue | 40 |
Pages of publication | 15220 - 15230 |
a | 7.9002 ± 0.0003 Å |
b | 18.0037 ± 0.0006 Å |
c | 11.387 ± 0.0005 Å |
α | 90° |
β | 94.962 ± 0.004° |
γ | 90° |
Cell volume | 1613.54 ± 0.11 Å3 |
Cell temperature | 133 ± 2 K |
Ambient diffraction temperature | 133 ± 2 K |
Number of distinct elements | 6 |
Space group number | 14 |
Hermann-Mauguin space group symbol | P 1 21/a 1 |
Hall space group symbol | -P 2yab |
Residual factor for all reflections | 0.0642 |
Residual factor for significantly intense reflections | 0.043 |
Weighted residual factors for significantly intense reflections | 0.1035 |
Weighted residual factors for all reflections included in the refinement | 0.1137 |
Goodness-of-fit parameter for all reflections included in the refinement | 1.037 |
Diffraction radiation wavelength | 0.71073 Å |
Diffraction radiation type | MoKα |