Information card for entry 7701181
Common name | [CuL38cBr] |
Formula | C14 H16 Br Cl Cu N2 O4 |
Calculated formula | C14 H16 Br Cl Cu N2 O4 |
Title of publication | Copper(ii) complexes with tridentate Schiff base-like ligands: solid state and solution structures and anticancer activity. |
Authors of publication | Dankhoff, Katja; Gold, Madeleine; Kober, Luisa; Schmitt, Florian; Pfeifer, Lena; Dürrmann, Andreas; Kostrhunova, Hana; Rothemund, Matthias; Brabec, Viktor; Schobert, Rainer; Weber, Birgit |
Journal of publication | Dalton transactions (Cambridge, England : 2003) |
Year of publication | 2019 |
Journal volume | 48 |
Journal issue | 40 |
Pages of publication | 15220 - 15230 |
a | 8.0351 ± 0.0003 Å |
b | 9.683 ± 0.0003 Å |
c | 11.4547 ± 0.0004 Å |
α | 98.869 ± 0.003° |
β | 102.321 ± 0.003° |
γ | 104.864 ± 0.003° |
Cell volume | 820.7 ± 0.05 Å3 |
Cell temperature | 133 ± 2 K |
Ambient diffraction temperature | 133 ± 2 K |
Number of distinct elements | 7 |
Space group number | 2 |
Hermann-Mauguin space group symbol | P -1 |
Hall space group symbol | -P 1 |
Residual factor for all reflections | 0.0504 |
Residual factor for significantly intense reflections | 0.0368 |
Weighted residual factors for significantly intense reflections | 0.0925 |
Weighted residual factors for all reflections included in the refinement | 0.0995 |
Goodness-of-fit parameter for all reflections included in the refinement | 1.041 |
Diffraction radiation wavelength | 0.71073 Å |
Diffraction radiation type | MoKα |