Information card for entry 7701183
Common name | [CuL30bBr] |
Formula | C24 H26 Br2 Cu2 N4 O4 |
Calculated formula | C24 H26 Br2 Cu2 N4 O4 |
Title of publication | Copper(ii) complexes with tridentate Schiff base-like ligands: solid state and solution structures and anticancer activity. |
Authors of publication | Dankhoff, Katja; Gold, Madeleine; Kober, Luisa; Schmitt, Florian; Pfeifer, Lena; Dürrmann, Andreas; Kostrhunova, Hana; Rothemund, Matthias; Brabec, Viktor; Schobert, Rainer; Weber, Birgit |
Journal of publication | Dalton transactions (Cambridge, England : 2003) |
Year of publication | 2019 |
Journal volume | 48 |
Journal issue | 40 |
Pages of publication | 15220 - 15230 |
a | 7.9933 ± 0.0007 Å |
b | 9.2785 ± 0.0011 Å |
c | 9.4396 ± 0.001 Å |
α | 90.031 ± 0.009° |
β | 98.575 ± 0.007° |
γ | 111.44 ± 0.008° |
Cell volume | 643.21 ± 0.12 Å3 |
Cell temperature | 133 ± 2 K |
Ambient diffraction temperature | 133 ± 2 K |
Number of distinct elements | 6 |
Space group number | 2 |
Hermann-Mauguin space group symbol | P -1 |
Hall space group symbol | -P 1 |
Residual factor for all reflections | 0.1116 |
Residual factor for significantly intense reflections | 0.0814 |
Weighted residual factors for significantly intense reflections | 0.2254 |
Weighted residual factors for all reflections included in the refinement | 0.2878 |
Goodness-of-fit parameter for all reflections included in the refinement | 1.064 |
Diffraction radiation wavelength | 0.71073 Å |
Diffraction radiation type | MoKα |