Information card for entry 7701184
Formula | C33 H33 Cl2 N3 Pd |
Calculated formula | C33 H33 Cl2 N3 Pd |
Title of publication | Palladium complexes of N-heterocyclic carbenes displaying an unsymmetrical N-alkylfluorenyl/N'-aryl substitution pattern and their behaviour in Suzuki-Miyaura cross coupling. |
Authors of publication | Almallah, Hamzé; Brenner, Eric; Matt, Dominique; Harrowfield, Jack; Jahjah, Mohamad; Hijazi, Akram |
Journal of publication | Dalton transactions (Cambridge, England : 2003) |
Year of publication | 2019 |
Journal volume | 48 |
Journal issue | 38 |
Pages of publication | 14516 - 14529 |
a | 10.7502 ± 0.0002 Å |
b | 24.8309 ± 0.0005 Å |
c | 11.0537 ± 0.0001 Å |
α | 90° |
β | 93.362 ± 0.001° |
γ | 90° |
Cell volume | 2945.56 ± 0.09 Å3 |
Cell temperature | 173 ± 2 K |
Ambient diffraction temperature | 173 ± 2 K |
Number of distinct elements | 5 |
Space group number | 14 |
Hermann-Mauguin space group symbol | P 1 21/n 1 |
Hall space group symbol | -P 2yn |
Residual factor for all reflections | 0.0681 |
Residual factor for significantly intense reflections | 0.0468 |
Weighted residual factors for significantly intense reflections | 0.0912 |
Weighted residual factors for all reflections included in the refinement | 0.1028 |
Goodness-of-fit parameter for all reflections included in the refinement | 1.085 |
Diffraction radiation wavelength | 0.71073 Å |
Diffraction radiation type | MoKα |