Information card for entry 7701185
Formula | C32 H31 Cl2 N3 Pd |
Calculated formula | C32 H31 Cl2 N3 Pd |
Title of publication | Palladium complexes of N-heterocyclic carbenes displaying an unsymmetrical N-alkylfluorenyl/N'-aryl substitution pattern and their behaviour in Suzuki-Miyaura cross coupling. |
Authors of publication | Almallah, Hamzé; Brenner, Eric; Matt, Dominique; Harrowfield, Jack; Jahjah, Mohamad; Hijazi, Akram |
Journal of publication | Dalton transactions (Cambridge, England : 2003) |
Year of publication | 2019 |
Journal volume | 48 |
Journal issue | 38 |
Pages of publication | 14516 - 14529 |
a | 10.7007 ± 0.0004 Å |
b | 14.7879 ± 0.0007 Å |
c | 17.9151 ± 0.0007 Å |
α | 90° |
β | 90° |
γ | 90° |
Cell volume | 2834.9 ± 0.2 Å3 |
Cell temperature | 173 ± 2 K |
Ambient diffraction temperature | 173 ± 2 K |
Number of distinct elements | 5 |
Space group number | 19 |
Hermann-Mauguin space group symbol | P 21 21 21 |
Hall space group symbol | P 2ac 2ab |
Residual factor for all reflections | 0.0371 |
Residual factor for significantly intense reflections | 0.0326 |
Weighted residual factors for significantly intense reflections | 0.0668 |
Weighted residual factors for all reflections included in the refinement | 0.0703 |
Goodness-of-fit parameter for all reflections included in the refinement | 1.172 |
Diffraction radiation wavelength | 0.71073 Å |
Diffraction radiation type | MoKα |