Information card for entry 7701188
Formula | C41.5 H31 Cl F3 N3 O3 Pt S |
Calculated formula | C41.5 H31 Cl F3 N3 O3 Pt S |
Title of publication | Selective synthesis, reactivity and luminescence of unsymmetrical bis-cyclometalated Pt(iv) complexes. |
Authors of publication | Vivancos, Ángela; Poveda, Dionisio; Muñoz, Alonso; Moreno, Julia; Bautista, Delia; González-Herrero, Pablo |
Journal of publication | Dalton transactions (Cambridge, England : 2003) |
Year of publication | 2019 |
Journal volume | 48 |
Journal issue | 38 |
Pages of publication | 14367 - 14382 |
a | 24.4833 ± 0.0011 Å |
b | 15.2726 ± 0.0007 Å |
c | 21.6707 ± 0.0015 Å |
α | 90° |
β | 119.347 ± 0.001° |
γ | 90° |
Cell volume | 7063.3 ± 0.7 Å3 |
Cell temperature | 100 ± 2 K |
Ambient diffraction temperature | 100 ± 2 K |
Number of distinct elements | 8 |
Space group number | 15 |
Hermann-Mauguin space group symbol | C 1 2/c 1 |
Hall space group symbol | -C 2yc |
Residual factor for all reflections | 0.0314 |
Residual factor for significantly intense reflections | 0.0232 |
Weighted residual factors for significantly intense reflections | 0.0558 |
Weighted residual factors for all reflections included in the refinement | 0.0593 |
Goodness-of-fit parameter for all reflections included in the refinement | 1.042 |
Diffraction radiation wavelength | 0.71073 Å |
Diffraction radiation type | MoKα |