Information card for entry 7701189
Formula | C28 H20 Cl2 N2 Pt |
Calculated formula | C28 H20 Cl2 N2 Pt |
Title of publication | Selective synthesis, reactivity and luminescence of unsymmetrical bis-cyclometalated Pt(iv) complexes. |
Authors of publication | Vivancos, Ángela; Poveda, Dionisio; Muñoz, Alonso; Moreno, Julia; Bautista, Delia; González-Herrero, Pablo |
Journal of publication | Dalton transactions (Cambridge, England : 2003) |
Year of publication | 2019 |
Journal volume | 48 |
Journal issue | 38 |
Pages of publication | 14367 - 14382 |
a | 10.0122 ± 0.0009 Å |
b | 23.216 ± 0.002 Å |
c | 11.0117 ± 0.0011 Å |
α | 90° |
β | 108.42 ± 0.003° |
γ | 90° |
Cell volume | 2428.5 ± 0.4 Å3 |
Cell temperature | 100 ± 2 K |
Ambient diffraction temperature | 100 ± 2 K |
Number of distinct elements | 5 |
Space group number | 14 |
Hermann-Mauguin space group symbol | P 1 21/n 1 |
Hall space group symbol | -P 2yn |
Residual factor for all reflections | 0.0223 |
Residual factor for significantly intense reflections | 0.0188 |
Weighted residual factors for significantly intense reflections | 0.0359 |
Weighted residual factors for all reflections included in the refinement | 0.0367 |
Goodness-of-fit parameter for all reflections included in the refinement | 1.099 |
Diffraction radiation wavelength | 0.71073 Å |
Diffraction radiation type | MoKα |