Information card for entry 7701190
Formula | C23 H16 Cl2 F2 N2 Pt |
Calculated formula | C23 H16 Cl2 F2 N2 Pt |
Title of publication | Selective synthesis, reactivity and luminescence of unsymmetrical bis-cyclometalated Pt(iv) complexes. |
Authors of publication | Vivancos, Ángela; Poveda, Dionisio; Muñoz, Alonso; Moreno, Julia; Bautista, Delia; González-Herrero, Pablo |
Journal of publication | Dalton transactions (Cambridge, England : 2003) |
Year of publication | 2019 |
Journal volume | 48 |
Journal issue | 38 |
Pages of publication | 14367 - 14382 |
a | 11.4079 ± 0.0005 Å |
b | 12.6215 ± 0.0005 Å |
c | 15.1221 ± 0.0006 Å |
α | 90° |
β | 106.659 ± 0.002° |
γ | 90° |
Cell volume | 2085.96 ± 0.15 Å3 |
Cell temperature | 100 ± 2 K |
Ambient diffraction temperature | 100 ± 2 K |
Number of distinct elements | 6 |
Space group number | 14 |
Hermann-Mauguin space group symbol | P 1 21/n 1 |
Hall space group symbol | -P 2yn |
Residual factor for all reflections | 0.022 |
Residual factor for significantly intense reflections | 0.0173 |
Weighted residual factors for significantly intense reflections | 0.0328 |
Weighted residual factors for all reflections included in the refinement | 0.0337 |
Goodness-of-fit parameter for all reflections included in the refinement | 1.097 |
Diffraction radiation wavelength | 0.71073 Å |
Diffraction radiation type | MoKα |