Information card for entry 7701194
Formula | C28 H21 Cl N2 Pt |
Calculated formula | C28 H21 Cl N2 Pt |
Title of publication | Selective synthesis, reactivity and luminescence of unsymmetrical bis-cyclometalated Pt(iv) complexes. |
Authors of publication | Vivancos, Ángela; Poveda, Dionisio; Muñoz, Alonso; Moreno, Julia; Bautista, Delia; González-Herrero, Pablo |
Journal of publication | Dalton transactions (Cambridge, England : 2003) |
Year of publication | 2019 |
Journal volume | 48 |
Journal issue | 38 |
Pages of publication | 14367 - 14382 |
a | 18.1592 ± 0.0016 Å |
b | 18.1592 ± 0.0016 Å |
c | 13.5259 ± 0.0012 Å |
α | 90° |
β | 90° |
γ | 90° |
Cell volume | 4460.3 ± 0.7 Å3 |
Cell temperature | 100 ± 2 K |
Ambient diffraction temperature | 100 ± 2 K |
Number of distinct elements | 5 |
Space group number | 82 |
Hermann-Mauguin space group symbol | I -4 |
Hall space group symbol | I -4 |
Residual factor for all reflections | 0.0128 |
Residual factor for significantly intense reflections | 0.0115 |
Weighted residual factors for significantly intense reflections | 0.0241 |
Weighted residual factors for all reflections included in the refinement | 0.0243 |
Goodness-of-fit parameter for all reflections included in the refinement | 1.078 |
Diffraction radiation wavelength | 0.71073 Å |
Diffraction radiation type | MoKα |