Information card for entry 7701195
Formula | C40 H57 F3 Mn N2 O6 P S |
Calculated formula | C40 H57 F3 Mn N2 O6 P S |
Title of publication | Inter-ligand intramolecular through-space anisotropic shielding in a series of manganese carbonyl phosphorous compounds. |
Authors of publication | Kurtz, Daniel A.; Dhakal, Badrinath; McDonald, Lauren T.; Nichol, Gary S.; Felton, Greg A. N. |
Journal of publication | Dalton transactions (Cambridge, England : 2003) |
Year of publication | 2019 |
Journal volume | 48 |
Journal issue | 39 |
Pages of publication | 14926 - 14935 |
a | 10.7958 ± 0.0005 Å |
b | 19.6144 ± 0.001 Å |
c | 20.04 ± 0.0011 Å |
α | 85.551 ± 0.005° |
β | 89.809 ± 0.004° |
γ | 76.872 ± 0.004° |
Cell volume | 4119.7 ± 0.4 Å3 |
Cell temperature | 120 ± 0.1 K |
Ambient diffraction temperature | 120 ± 0.1 K |
Number of distinct elements | 8 |
Space group number | 2 |
Hermann-Mauguin space group symbol | P -1 |
Hall space group symbol | -P 1 |
Residual factor for all reflections | 0.1283 |
Residual factor for significantly intense reflections | 0.092 |
Weighted residual factors for significantly intense reflections | 0.1981 |
Weighted residual factors for all reflections included in the refinement | 0.2169 |
Goodness-of-fit parameter for all reflections included in the refinement | 1.075 |
Diffraction radiation probe | x-ray |
Diffraction radiation wavelength | 0.71073 Å |
Diffraction radiation type | MoKα |