Information card for entry 7701198
Formula | C122 H117 Dy4 N19 O36 |
Calculated formula | C122 H117 Dy4 N19 O36 |
Title of publication | Construction of homochiral alkaline-lanthanide heteronuclear helicates with Na<sup>+</sup>-selective bonding in the self-assembly process. |
Authors of publication | Li, Ge; Wang, Li; Han, Qingxin; Liu, Weisheng |
Journal of publication | Dalton transactions (Cambridge, England : 2003) |
Year of publication | 2019 |
Journal volume | 48 |
Journal issue | 39 |
Pages of publication | 14595 - 14599 |
a | 16.5304 ± 0.0004 Å |
b | 21.5083 ± 0.0005 Å |
c | 34.7813 ± 0.0007 Å |
α | 90° |
β | 90° |
γ | 90° |
Cell volume | 12366.2 ± 0.5 Å3 |
Cell temperature | 153.15 K |
Ambient diffraction temperature | 153.15 K |
Number of distinct elements | 5 |
Space group number | 19 |
Hermann-Mauguin space group symbol | P 21 21 21 |
Hall space group symbol | P 2ac 2ab |
Residual factor for all reflections | 0.0417 |
Residual factor for significantly intense reflections | 0.0401 |
Weighted residual factors for significantly intense reflections | 0.1051 |
Weighted residual factors for all reflections included in the refinement | 0.1061 |
Goodness-of-fit parameter for all reflections included in the refinement | 1.022 |
Diffraction radiation wavelength | 1.54178 Å |
Diffraction radiation type | CuKα |