Information card for entry 7701199
Formula | C203 H213 Cl2 Dy4 N34 Na6 O72 |
Calculated formula | C203 H213 Cl2 Dy4 N34 Na6 O72 |
Title of publication | Construction of homochiral alkaline-lanthanide heteronuclear helicates with Na<sup>+</sup>-selective bonding in the self-assembly process. |
Authors of publication | Li, Ge; Wang, Li; Han, Qingxin; Liu, Weisheng |
Journal of publication | Dalton transactions (Cambridge, England : 2003) |
Year of publication | 2019 |
Journal volume | 48 |
Journal issue | 39 |
Pages of publication | 14595 - 14599 |
a | 20.2482 ± 0.0002 Å |
b | 21.6632 ± 0.0002 Å |
c | 55.8238 ± 0.0006 Å |
α | 90° |
β | 90° |
γ | 90° |
Cell volume | 24486.6 ± 0.4 Å3 |
Cell temperature | 119.99 ± 0.1 K |
Ambient diffraction temperature | 119.99 ± 0.1 K |
Number of distinct elements | 7 |
Space group number | 20 |
Hermann-Mauguin space group symbol | C 2 2 21 |
Hall space group symbol | C 2c 2 |
Residual factor for all reflections | 0.0479 |
Residual factor for significantly intense reflections | 0.0445 |
Weighted residual factors for significantly intense reflections | 0.1221 |
Weighted residual factors for all reflections included in the refinement | 0.1243 |
Goodness-of-fit parameter for all reflections included in the refinement | 1.064 |
Diffraction radiation probe | x-ray |
Diffraction radiation wavelength | 1.54184 Å |
Diffraction radiation type | CuKα |