Information card for entry 7701200
Formula | C121 H116 Dy4 N19 O39 |
Calculated formula | C121 H116 Dy4 N19 O39 |
Title of publication | Construction of homochiral alkaline-lanthanide heteronuclear helicates with Na<sup>+</sup>-selective bonding in the self-assembly process. |
Authors of publication | Li, Ge; Wang, Li; Han, Qingxin; Liu, Weisheng |
Journal of publication | Dalton transactions (Cambridge, England : 2003) |
Year of publication | 2019 |
Journal volume | 48 |
Journal issue | 39 |
Pages of publication | 14595 - 14599 |
a | 16.4632 ± 0.0002 Å |
b | 21.676 ± 0.0004 Å |
c | 34.76 ± 0.0006 Å |
α | 90° |
β | 90° |
γ | 90° |
Cell volume | 12404.3 ± 0.3 Å3 |
Cell temperature | 100 ± 0.1 K |
Ambient diffraction temperature | 100 ± 0.1 K |
Number of distinct elements | 5 |
Space group number | 19 |
Hermann-Mauguin space group symbol | P 21 21 21 |
Hall space group symbol | P 2ac 2ab |
Residual factor for all reflections | 0.0667 |
Residual factor for significantly intense reflections | 0.0521 |
Weighted residual factors for significantly intense reflections | 0.1248 |
Weighted residual factors for all reflections included in the refinement | 0.1355 |
Goodness-of-fit parameter for all reflections included in the refinement | 1.029 |
Diffraction radiation probe | x-ray |
Diffraction radiation wavelength | 0.71073 Å |
Diffraction radiation type | MoKα |