Information card for entry 7701223
Chemical name | (3,3??,5,5??-Tetramethoxycarbonyl-1,1?:3?,1??-terphen-2?-yl)diphenylphosphane oxide |
Formula | C38 H31 O9 P |
Calculated formula | C38 H31 O9 P |
Title of publication | A new set of metal-organic frameworks synthesised from diisophthalate-based, 2'-phosphorus-substituted m-terphenyl linker molecules. |
Authors of publication | Stein, Timo; Hoffmann, Frank; Fröba, Michael |
Journal of publication | Dalton transactions (Cambridge, England : 2003) |
Year of publication | 2019 |
Journal volume | 48 |
Journal issue | 40 |
Pages of publication | 15127 - 15135 |
a | 36.1084 ± 0.0004 Å |
b | 12.0821 ± 0.0001 Å |
c | 15.1558 ± 0.0002 Å |
α | 90° |
β | 99.44 ± 0.001° |
γ | 90° |
Cell volume | 6522.41 ± 0.13 Å3 |
Cell temperature | 100 ± 2 K |
Ambient diffraction temperature | 100 ± 2 K |
Number of distinct elements | 4 |
Space group number | 15 |
Hermann-Mauguin space group symbol | C 1 2/c 1 |
Hall space group symbol | -C 2yc |
Residual factor for all reflections | 0.0421 |
Residual factor for significantly intense reflections | 0.0381 |
Weighted residual factors for significantly intense reflections | 0.0937 |
Weighted residual factors for all reflections included in the refinement | 0.098 |
Goodness-of-fit parameter for all reflections included in the refinement | 1.029 |
Diffraction radiation probe | x-ray |
Diffraction radiation wavelength | 1.54178 Å |
Diffraction radiation type | CuKα |