Information card for entry 7701224
Chemical name | (3,3??,5,5??-Tetramethoxycarbonyl-1,1?:3?,1??-terphen-2?-yl)dimethylphosphane sulfide |
Formula | C28 H27 O8 P S |
Calculated formula | C28 H27 O8 P S |
Title of publication | A new set of metal-organic frameworks synthesised from diisophthalate-based, 2'-phosphorus-substituted m-terphenyl linker molecules. |
Authors of publication | Stein, Timo; Hoffmann, Frank; Fröba, Michael |
Journal of publication | Dalton transactions (Cambridge, England : 2003) |
Year of publication | 2019 |
Journal volume | 48 |
Journal issue | 40 |
Pages of publication | 15127 - 15135 |
a | 10.8386 ± 0.0004 Å |
b | 11.5955 ± 0.0005 Å |
c | 11.7352 ± 0.0004 Å |
α | 100.68 ± 0.004° |
β | 109.425 ± 0.003° |
γ | 103.752 ± 0.003° |
Cell volume | 1293.55 ± 0.1 Å3 |
Cell temperature | 100 ± 2 K |
Ambient diffraction temperature | 100 ± 2 K |
Number of distinct elements | 5 |
Space group number | 2 |
Hermann-Mauguin space group symbol | P -1 |
Hall space group symbol | -P 1 |
Residual factor for all reflections | 0.1034 |
Residual factor for significantly intense reflections | 0.0654 |
Weighted residual factors for significantly intense reflections | 0.159 |
Weighted residual factors for all reflections included in the refinement | 0.1787 |
Goodness-of-fit parameter for all reflections included in the refinement | 1.042 |
Diffraction radiation probe | x-ray |
Diffraction radiation wavelength | 0.71073 Å |
Diffraction radiation type | MoKα |