Information card for entry 7701536
Formula | C40 H62 B F N2 |
Calculated formula | C40 H62 B F N2 |
Title of publication | Isolation of base stabilized fluoroborylene and its radical cation. |
Authors of publication | Sarkar, Samir Kumar; Siddiqui, Mujahuddin M.; Kundu, Subrata; Ghosh, Munmun; Kretsch, Johannes; Stollberg, Peter; Herbst-Irmer, Regine; Stalke, Dietmar; Stückl, A Claudia; Schwederski, Brigitte; Kaim, Wolfgang; Ghorai, Sagar; Jemmis, Eluvathingal D.; Roesky, Herbert W. |
Journal of publication | Dalton transactions (Cambridge, England : 2003) |
Year of publication | 2019 |
Journal volume | 48 |
Journal issue | 24 |
Pages of publication | 8551 - 8555 |
a | 10.679 ± 0.002 Å |
b | 19.037 ± 0.003 Å |
c | 20.054 ± 0.003 Å |
α | 104.98 ± 0.02° |
β | 102.8 ± 0.02° |
γ | 102.62 ± 0.02° |
Cell volume | 3672.3 ± 1.3 Å3 |
Cell temperature | 100 ± 2 K |
Ambient diffraction temperature | 100 ± 2 K |
Number of distinct elements | 5 |
Space group number | 2 |
Hermann-Mauguin space group symbol | P -1 |
Hall space group symbol | -P 1 |
Residual factor for all reflections | 0.0609 |
Residual factor for significantly intense reflections | 0.0413 |
Weighted residual factors for significantly intense reflections | 0.0915 |
Weighted residual factors for all reflections included in the refinement | 0.102 |
Goodness-of-fit parameter for all reflections included in the refinement | 1.01 |
Diffraction radiation wavelength | 0.71073 Å |
Diffraction radiation type | MoKα |