Information card for entry 7701555
Formula | C17 H49 Ca N3 O Si4 |
Calculated formula | C17 H49 Ca N3 O Si4 |
Title of publication | Bis(trimethylsilyl)amide complexes of s-block metals with bidentate ether and amine ligands. |
Authors of publication | Schüler, Philipp; Görls, Helmar; Westerhausen, Matthias; Krieck, Sven |
Journal of publication | Dalton transactions (Cambridge, England : 2003) |
Year of publication | 2019 |
Journal volume | 48 |
Journal issue | 24 |
Pages of publication | 8966 - 8975 |
a | 8.573 ± 0.0002 Å |
b | 17.0814 ± 0.0006 Å |
c | 20.3873 ± 0.0007 Å |
α | 90° |
β | 100.288 ± 0.002° |
γ | 90° |
Cell volume | 2937.49 ± 0.16 Å3 |
Cell temperature | 133 ± 2 K |
Ambient diffraction temperature | 133 ± 2 K |
Number of distinct elements | 6 |
Space group number | 15 |
Hermann-Mauguin space group symbol | C 1 2/c 1 |
Hall space group symbol | -C 2yc |
Residual factor for all reflections | 0.0489 |
Residual factor for significantly intense reflections | 0.0405 |
Weighted residual factors for significantly intense reflections | 0.0879 |
Weighted residual factors for all reflections included in the refinement | 0.093 |
Goodness-of-fit parameter for all reflections included in the refinement | 1.076 |
Diffraction radiation wavelength | 0.71073 Å |
Diffraction radiation type | MoKα |