Information card for entry 7702011
Chemical name | 2c |
Formula | C73 H74 Cl4 Fe N2 P2 Pt2 |
Calculated formula | C73 H74 Cl4 Fe N2 P2 Pt2 |
Title of publication | Cyclometallated platinum(II) complexes of benzylidene-2,6-di-isopropylphenylamine containing bidentate phosphines: synthesis, structural properties and reactivity studies. |
Authors of publication | Zheng, Feng; Hutton, Alan T.; van Sittert, Cornelia G. C. E.; Gerber, Wilhelmus J.; Mapolie, Selwyn F. |
Journal of publication | Dalton transactions (Cambridge, England : 2003) |
Year of publication | 2015 |
Journal volume | 44 |
Journal issue | 4 |
Pages of publication | 1969 - 1981 |
a | 21.2184 ± 0.0018 Å |
b | 37.581 ± 0.003 Å |
c | 17.8803 ± 0.0014 Å |
α | 90° |
β | 90° |
γ | 90° |
Cell volume | 14258 ± 2 Å3 |
Cell temperature | 100 ± 2 K |
Ambient diffraction temperature | 100 ± 2 K |
Number of distinct elements | 7 |
Space group number | 68 |
Hermann-Mauguin space group symbol | C c c a :2 |
Hall space group symbol | -C 2a 2ac |
Residual factor for all reflections | 0.0495 |
Residual factor for significantly intense reflections | 0.0303 |
Weighted residual factors for significantly intense reflections | 0.0575 |
Weighted residual factors for all reflections included in the refinement | 0.0618 |
Goodness-of-fit parameter for all reflections included in the refinement | 1.08 |
Diffraction radiation wavelength | 0.71073 Å |
Diffraction radiation type | MoKα |