Information card for entry 7702012
Common name | 2c |
Formula | C63 H66 Cl2 N2 P2 Pt2 |
Calculated formula | C63 H66 Cl2 N2 P2 Pt2 |
Title of publication | Cyclometallated platinum(II) complexes of benzylidene-2,6-di-isopropylphenylamine containing bidentate phosphines: synthesis, structural properties and reactivity studies. |
Authors of publication | Zheng, Feng; Hutton, Alan T.; van Sittert, Cornelia G. C. E.; Gerber, Wilhelmus J.; Mapolie, Selwyn F. |
Journal of publication | Dalton transactions (Cambridge, England : 2003) |
Year of publication | 2015 |
Journal volume | 44 |
Journal issue | 4 |
Pages of publication | 1969 - 1981 |
a | 12.4432 ± 0.0005 Å |
b | 17.0241 ± 0.0007 Å |
c | 26.2651 ± 0.0011 Å |
α | 90° |
β | 96.904 ± 0.001° |
γ | 90° |
Cell volume | 5523.5 ± 0.4 Å3 |
Cell temperature | 105 ± 2 K |
Ambient diffraction temperature | 105 ± 2 K |
Ambient diffracton pressure | 101.3 kPa |
Number of distinct elements | 6 |
Space group number | 14 |
Hermann-Mauguin space group symbol | P 1 21/n 1 |
Hall space group symbol | -P 2yn |
Residual factor for all reflections | 0.0481 |
Residual factor for significantly intense reflections | 0.032 |
Weighted residual factors for significantly intense reflections | 0.0577 |
Weighted residual factors for all reflections included in the refinement | 0.0628 |
Goodness-of-fit parameter for all reflections included in the refinement | 0.997 |
Diffraction radiation wavelength | 0.71073 Å |
Diffraction radiation type | MoKα |