Information card for entry 7702041
Formula | C36 H36 Al N2 O2 |
Calculated formula | C36 H36 Al N2 O2 |
Title of publication | Aluminum methyl, alkoxide and α-alkoxy ester complexes supported by 6,6'-dimethylbiphenyl-bridged salen ligands: synthesis, characterization and catalysis for rac-lactide polymerization. |
Authors of publication | Kan, Chao; Ge, Jilei; Ma, Haiyan |
Journal of publication | Dalton transactions (Cambridge, England : 2003) |
Year of publication | 2016 |
Journal volume | 45 |
Journal issue | 15 |
Pages of publication | 6682 - 6695 |
a | 28.105 ± 0.003 Å |
b | 12.885 ± 0.0015 Å |
c | 17.816 ± 0.002 Å |
α | 90° |
β | 108.596 ± 0.002° |
γ | 90° |
Cell volume | 6114.9 ± 1.2 Å3 |
Cell temperature | 140 ± 2 K |
Ambient diffraction temperature | 140 ± 2 K |
Number of distinct elements | 5 |
Space group number | 15 |
Hermann-Mauguin space group symbol | C 1 2/c 1 |
Hall space group symbol | -C 2yc |
Residual factor for all reflections | 0.0911 |
Residual factor for significantly intense reflections | 0.0515 |
Weighted residual factors for significantly intense reflections | 0.1324 |
Weighted residual factors for all reflections included in the refinement | 0.1561 |
Goodness-of-fit parameter for all reflections included in the refinement | 1.015 |
Diffraction radiation wavelength | 0.71073 Å |
Diffraction radiation type | MoKα |