Information card for entry 7702042
Formula | C39 H45 Al N2 O2 |
Calculated formula | C39 H45 Al N2 O2 |
Title of publication | Aluminum methyl, alkoxide and α-alkoxy ester complexes supported by 6,6'-dimethylbiphenyl-bridged salen ligands: synthesis, characterization and catalysis for rac-lactide polymerization. |
Authors of publication | Kan, Chao; Ge, Jilei; Ma, Haiyan |
Journal of publication | Dalton transactions (Cambridge, England : 2003) |
Year of publication | 2016 |
Journal volume | 45 |
Journal issue | 15 |
Pages of publication | 6682 - 6695 |
a | 29.421 ± 0.005 Å |
b | 11.873 ± 0.002 Å |
c | 20.751 ± 0.004 Å |
α | 90° |
β | 109.235 ± 0.003° |
γ | 90° |
Cell volume | 6844 ± 2 Å3 |
Cell temperature | 140 ± 2 K |
Ambient diffraction temperature | 140 ± 2 K |
Number of distinct elements | 5 |
Space group number | 15 |
Hermann-Mauguin space group symbol | C 1 2/c 1 |
Hall space group symbol | -C 2yc |
Residual factor for all reflections | 0.1712 |
Residual factor for significantly intense reflections | 0.0717 |
Weighted residual factors for significantly intense reflections | 0.1589 |
Weighted residual factors for all reflections included in the refinement | 0.2116 |
Goodness-of-fit parameter for all reflections included in the refinement | 0.965 |
Diffraction radiation wavelength | 0.71073 Å |
Diffraction radiation type | MoKα |