Information card for entry 7702097
Formula | C4 H12 Cl8 Nb2 S2 |
Calculated formula | C4 H12 Cl8 Nb2 S2 |
Title of publication | Niobium tetrachloride complexes with thio-, seleno- and telluro-ether coordination - synthesis and structures. |
Authors of publication | Chang, Yao-Pang; Levason, William; Light, Mark E.; Reid, Gillian |
Journal of publication | Dalton transactions (Cambridge, England : 2003) |
Year of publication | 2016 |
Journal volume | 45 |
Journal issue | 41 |
Pages of publication | 16262 - 16274 |
a | 6.4589 ± 0.0002 Å |
b | 10.1598 ± 0.0004 Å |
c | 13.1644 ± 0.0005 Å |
α | 90° |
β | 94.499 ± 0.004° |
γ | 90° |
Cell volume | 861.2 ± 0.05 Å3 |
Cell temperature | 100 ± 2 K |
Ambient diffraction temperature | 100 ± 2 K |
Number of distinct elements | 5 |
Space group number | 14 |
Hermann-Mauguin space group symbol | P 1 21/n 1 |
Hall space group symbol | -P 2yn |
Residual factor for all reflections | 0.0233 |
Residual factor for significantly intense reflections | 0.0205 |
Weighted residual factors for significantly intense reflections | 0.0509 |
Weighted residual factors for all reflections included in the refinement | 0.0521 |
Goodness-of-fit parameter for all reflections included in the refinement | 1.03 |
Diffraction radiation wavelength | 0.71073 Å |
Diffraction radiation type | MoKα |