Information card for entry 7702098
Formula | C4 H12 Cl8 Nb2 Se2 |
Calculated formula | C4 H12 Cl8 Nb2 Se2 |
Title of publication | Niobium tetrachloride complexes with thio-, seleno- and telluro-ether coordination - synthesis and structures. |
Authors of publication | Chang, Yao-Pang; Levason, William; Light, Mark E.; Reid, Gillian |
Journal of publication | Dalton transactions (Cambridge, England : 2003) |
Year of publication | 2016 |
Journal volume | 45 |
Journal issue | 41 |
Pages of publication | 16262 - 16274 |
a | 10.4725 ± 0.0008 Å |
b | 7.2592 ± 0.0005 Å |
c | 22.5009 ± 0.0012 Å |
α | 90° |
β | 90° |
γ | 90° |
Cell volume | 1710.6 ± 0.2 Å3 |
Cell temperature | 100 ± 2 K |
Ambient diffraction temperature | 100 ± 2 K |
Number of distinct elements | 5 |
Space group number | 64 |
Hermann-Mauguin space group symbol | C m c e |
Hall space group symbol | -C 2ac 2 |
Residual factor for all reflections | 0.0391 |
Residual factor for significantly intense reflections | 0.0291 |
Weighted residual factors for significantly intense reflections | 0.0603 |
Weighted residual factors for all reflections included in the refinement | 0.0638 |
Goodness-of-fit parameter for all reflections included in the refinement | 1.089 |
Diffraction radiation wavelength | 0.71073 Å |
Diffraction radiation type | MoKα |