Information card for entry 7702099
Formula | C8 H24 Cl8 Nb2 Te4 |
Calculated formula | C8 H24 Cl8 Nb2 Te4 |
Title of publication | Niobium tetrachloride complexes with thio-, seleno- and telluro-ether coordination - synthesis and structures. |
Authors of publication | Chang, Yao-Pang; Levason, William; Light, Mark E.; Reid, Gillian |
Journal of publication | Dalton transactions (Cambridge, England : 2003) |
Year of publication | 2016 |
Journal volume | 45 |
Journal issue | 41 |
Pages of publication | 16262 - 16274 |
a | 10.4835 ± 0.0001 Å |
b | 10.4835 ± 0.0001 Å |
c | 12.0612 ± 0.0002 Å |
α | 90° |
β | 90° |
γ | 90° |
Cell volume | 1325.57 ± 0.03 Å3 |
Cell temperature | 100 ± 2 K |
Ambient diffraction temperature | 100 ± 2 K |
Number of distinct elements | 5 |
Space group number | 94 |
Hermann-Mauguin space group symbol | P 42 21 2 |
Hall space group symbol | P 4n 2n |
Residual factor for all reflections | 0.012 |
Residual factor for significantly intense reflections | 0.0119 |
Weighted residual factors for significantly intense reflections | 0.0295 |
Weighted residual factors for all reflections included in the refinement | 0.0295 |
Goodness-of-fit parameter for all reflections included in the refinement | 1.081 |
Diffraction radiation wavelength | 0.71073 Å |
Diffraction radiation type | MoKα |