Information card for entry 7702917
Formula | C140 H161 N13 Na2 O69 Tb6 |
Calculated formula | C138 H127 N13 Na2 O56 Tb6 |
Title of publication | Synthesis, structures and magnetic properties of a family of nitrate-bridged octanuclear [Na2Ln6] (Ln = Dy, Tb, Gd, Sm) complexes. |
Authors of publication | She, Shixiong; Chen, Yanmei; Zaworotko, Michael J.; Liu, Wei; Cao, Yanyuan; Wu, Jian; Li, Yahong |
Journal of publication | Dalton transactions (Cambridge, England : 2003) |
Year of publication | 2013 |
Journal volume | 42 |
Journal issue | 29 |
Pages of publication | 10433 - 10438 |
a | 28.8424 ± 0.0005 Å |
b | 19.601 ± 0.0003 Å |
c | 30.8266 ± 0.0005 Å |
α | 90° |
β | 104.05 ± 0.001° |
γ | 90° |
Cell volume | 16906.1 ± 0.5 Å3 |
Cell temperature | 293 ± 2 K |
Ambient diffraction temperature | 293 ± 2 K |
Number of distinct elements | 6 |
Space group number | 15 |
Hermann-Mauguin space group symbol | C 1 2/c 1 |
Hall space group symbol | -C 2yc |
Residual factor for all reflections | 0.0552 |
Residual factor for significantly intense reflections | 0.0384 |
Weighted residual factors for significantly intense reflections | 0.1089 |
Weighted residual factors for all reflections included in the refinement | 0.118 |
Goodness-of-fit parameter for all reflections included in the refinement | 1.04 |
Diffraction radiation wavelength | 0.71073 Å |
Diffraction radiation type | MoKα |