Information card for entry 7706243
Formula | C20 H8 N2 O8 Tb |
Calculated formula | C20 H8 N2 O8 Tb |
Title of publication | The construction of a novel luminescent lanthanide framework for the selective sensing of Cu<sup>2+</sup> and 4-nitrophenol in water. |
Authors of publication | Lin, Zeng-Gang; Song, Fu-Qiang; Wang, Hui; Song, Xue-Qin; Yu, Xin-Xin; Liu, Wei-Sheng |
Journal of publication | Dalton transactions (Cambridge, England : 2003) |
Year of publication | 2021 |
Journal volume | 50 |
Journal issue | 5 |
Pages of publication | 1874 - 1886 |
a | 30.5392 ± 0.0007 Å |
b | 30.5392 ± 0.0007 Å |
c | 13.0003 ± 0.0004 Å |
α | 90° |
β | 90° |
γ | 120° |
Cell volume | 10500.2 ± 0.5 Å3 |
Cell temperature | 293 ± 2 K |
Ambient diffraction temperature | 293 ± 2 K |
Number of distinct elements | 5 |
Space group number | 165 |
Hermann-Mauguin space group symbol | P -3 c 1 |
Hall space group symbol | -P 3 2"c |
Residual factor for all reflections | 0.0586 |
Residual factor for significantly intense reflections | 0.045 |
Weighted residual factors for significantly intense reflections | 0.116 |
Weighted residual factors for all reflections included in the refinement | 0.1234 |
Goodness-of-fit parameter for all reflections included in the refinement | 1.044 |
Diffraction radiation wavelength | 1.54184 Å |
Diffraction radiation type | CuKα |