Information card for entry 7706244
Formula | C20 H6 Eu N2 O8 |
Calculated formula | C20 H6 Eu N2 O8 |
Title of publication | The construction of a novel luminescent lanthanide framework for the selective sensing of Cu<sup>2+</sup> and 4-nitrophenol in water. |
Authors of publication | Lin, Zeng-Gang; Song, Fu-Qiang; Wang, Hui; Song, Xue-Qin; Yu, Xin-Xin; Liu, Wei-Sheng |
Journal of publication | Dalton transactions (Cambridge, England : 2003) |
Year of publication | 2021 |
Journal volume | 50 |
Journal issue | 5 |
Pages of publication | 1874 - 1886 |
a | 30.8375 ± 0.0008 Å |
b | 30.8375 ± 0.0008 Å |
c | 12.9766 ± 0.0005 Å |
α | 90° |
β | 90° |
γ | 120° |
Cell volume | 10686.9 ± 0.6 Å3 |
Cell temperature | 100 ± 2 K |
Ambient diffraction temperature | 99.98 K |
Number of distinct elements | 5 |
Space group number | 165 |
Hermann-Mauguin space group symbol | P -3 c 1 |
Hall space group symbol | -P 3 2"c |
Residual factor for all reflections | 0.0685 |
Residual factor for significantly intense reflections | 0.0675 |
Weighted residual factors for significantly intense reflections | 0.1872 |
Weighted residual factors for all reflections included in the refinement | 0.1879 |
Goodness-of-fit parameter for all reflections included in the refinement | 1.042 |
Diffraction radiation wavelength | 0.71073 Å |
Diffraction radiation type | MoKα |