Information card for entry 7706361
Chemical name | 4-Cl(NPh2) |
Formula | C25 H40 B Cl2 F N P4 Pt2 |
Calculated formula | C25 H40 B Cl2 F N P4 Pt2 |
Title of publication | Synthesis and characterisation of boranediyl- and diboranediyl-bridged diplatinum A-frame complexes. |
Authors of publication | Brunecker, Carina; Arrowsmith, Merle; Müssig, Jonas H; Böhnke, Julian; Stoy, Andreas; Heß, Merlin; Hofmann, Alexander; Lenczyk, Carsten; Lichtenberg, Crispin; Ramler, Jacqueline; Rempel, Anna; Braunschweig, Holger |
Journal of publication | Dalton transactions (Cambridge, England : 2003) |
Year of publication | 2021 |
Journal volume | 50 |
Journal issue | 10 |
Pages of publication | 3506 - 3515 |
a | 15 ± 0.0005 Å |
b | 11.3002 ± 0.0004 Å |
c | 19.1129 ± 0.0006 Å |
α | 90° |
β | 93.165 ± 0.001° |
γ | 90° |
Cell volume | 3234.75 ± 0.19 Å3 |
Cell temperature | 100 ± 2 K |
Ambient diffraction temperature | 100 ± 2 K |
Number of distinct elements | 8 |
Space group number | 14 |
Hermann-Mauguin space group symbol | P 1 21/c 1 |
Hall space group symbol | -P 2ybc |
Residual factor for all reflections | 0.0406 |
Residual factor for significantly intense reflections | 0.0291 |
Weighted residual factors for significantly intense reflections | 0.0567 |
Weighted residual factors for all reflections included in the refinement | 0.0615 |
Goodness-of-fit parameter for all reflections included in the refinement | 1.047 |
Diffraction radiation wavelength | 0.71073 Å |
Diffraction radiation type | MoKα |