Information card for entry 7706362
Chemical name | 4-Cl(Cl) |
Formula | C13 H30 B Cl3 F P4 Pt2 |
Calculated formula | C13 H30 B Cl3 F P4 Pt2 |
Title of publication | Synthesis and characterisation of boranediyl- and diboranediyl-bridged diplatinum A-frame complexes. |
Authors of publication | Brunecker, Carina; Arrowsmith, Merle; Müssig, Jonas H; Böhnke, Julian; Stoy, Andreas; Heß, Merlin; Hofmann, Alexander; Lenczyk, Carsten; Lichtenberg, Crispin; Ramler, Jacqueline; Rempel, Anna; Braunschweig, Holger |
Journal of publication | Dalton transactions (Cambridge, England : 2003) |
Year of publication | 2021 |
Journal volume | 50 |
Journal issue | 10 |
Pages of publication | 3506 - 3515 |
a | 14.055 ± 0.002 Å |
b | 11.8205 ± 0.0014 Å |
c | 15.0133 ± 0.0016 Å |
α | 90° |
β | 98.271 ± 0.009° |
γ | 90° |
Cell volume | 2468.3 ± 0.5 Å3 |
Cell temperature | 100 ± 2 K |
Ambient diffraction temperature | 100 ± 2 K |
Number of distinct elements | 7 |
Space group number | 4 |
Hermann-Mauguin space group symbol | P 1 21 1 |
Hall space group symbol | P 2yb |
Residual factor for all reflections | 0.0145 |
Residual factor for significantly intense reflections | 0.0142 |
Weighted residual factors for significantly intense reflections | 0.0326 |
Weighted residual factors for all reflections included in the refinement | 0.0327 |
Goodness-of-fit parameter for all reflections included in the refinement | 1.079 |
Diffraction radiation wavelength | 0.71073 Å |
Diffraction radiation type | MoKα |