Information card for entry 7708224
Common name | Holmium 2,2':6',2''-terpyridine-4'-carboxyli |
Formula | C18 Ho N3 O6 |
Calculated formula | C18 Ho N3 O6 |
Title of publication | Achieving Colour Tuneable and White-Light Luminescence in a Large Family of Dual-Emission Lanthanide Coordination Polymers |
Authors of publication | Qian, Junfeng; Lu, Huangjie; Zheng, Zhaofa; Xu, Miaomiao; Qian, Yuan; Zhang, Zhi-Hui; Wang, Jian-Qiang; He, Mingyang; Lin, Jian |
Journal of publication | Dalton Transactions |
Year of publication | 2021 |
a | 17.943 ± 0.003 Å |
b | 9.4929 ± 0.0016 Å |
c | 11.8703 ± 0.0019 Å |
α | 90° |
β | 125.173 ± 0.005° |
γ | 90° |
Cell volume | 1652.7 ± 0.5 Å3 |
Cell temperature | 293 ± 2 K |
Ambient diffraction temperature | 293 ± 2 K |
Number of distinct elements | 4 |
Space group number | 15 |
Hermann-Mauguin space group symbol | C 1 2/c 1 |
Hall space group symbol | -C 2yc |
Residual factor for all reflections | 0.0198 |
Residual factor for significantly intense reflections | 0.0189 |
Weighted residual factors for significantly intense reflections | 0.0539 |
Weighted residual factors for all reflections included in the refinement | 0.0546 |
Goodness-of-fit parameter for all reflections included in the refinement | 1.095 |
Diffraction radiation wavelength | 0.71073 Å |
Diffraction radiation type | MoKα |