Information card for entry 7708225
Common name | Holmium 2,2':6',2''-terpyridine-4'-carboxyli |
Formula | C33 Ho N6 O7 |
Calculated formula | C33 Ho N6 O7 |
Title of publication | Achieving Colour Tuneable and White-Light Luminescence in a Large Family of Dual-Emission Lanthanide Coordination Polymers |
Authors of publication | Qian, Junfeng; Lu, Huangjie; Zheng, Zhaofa; Xu, Miaomiao; Qian, Yuan; Zhang, Zhi-Hui; Wang, Jian-Qiang; He, Mingyang; Lin, Jian |
Journal of publication | Dalton Transactions |
Year of publication | 2021 |
a | 8.8861 ± 0.0007 Å |
b | 36.999 ± 0.002 Å |
c | 9.4549 ± 0.0007 Å |
α | 90° |
β | 106.468 ± 0.002° |
γ | 90° |
Cell volume | 2981 ± 0.4 Å3 |
Cell temperature | 273 ± 2 K |
Ambient diffraction temperature | 273 ± 2 K |
Number of distinct elements | 4 |
Space group number | 14 |
Hermann-Mauguin space group symbol | P 1 21/c 1 |
Hall space group symbol | -P 2ybc |
Residual factor for all reflections | 0.0622 |
Residual factor for significantly intense reflections | 0.038 |
Weighted residual factors for significantly intense reflections | 0.0883 |
Weighted residual factors for all reflections included in the refinement | 0.1001 |
Goodness-of-fit parameter for all reflections included in the refinement | 1.008 |
Diffraction radiation wavelength | 0.71073 Å |
Diffraction radiation type | MoKα |