Information card for entry 7708672
Formula |
C34 H30 Cd N4 O10 |
Calculated formula |
C34 H30 Cd N4 O10 |
Title of publication |
Synthesis of Silyl Iron Dinitrogen Complexes for Activation of Dihydrogen and Catalytic Silylation of Dinitrogen |
Authors of publication |
Chang, Guoliang; Zhang, Peng; Yang, Wenjing; Dong, Yanhong; Xie, Shangqing; Sun, Hongjian; Li, Xiaoyan; Fuhr, Olaf; Fenske, Dieter |
Journal of publication |
Dalton Transactions |
Year of publication |
2021 |
a |
9.8116 ± 0.0009 Å |
b |
12.684 ± 0.0012 Å |
c |
13.3634 ± 0.0013 Å |
α |
94.724 ± 0.003° |
β |
95.303 ± 0.003° |
γ |
98.275 ± 0.003° |
Cell volume |
1631 ± 0.3 Å3 |
Cell temperature |
293 ± 2 K |
Ambient diffraction temperature |
293 ± 2 K |
Number of distinct elements |
5 |
Space group number |
2 |
Hermann-Mauguin space group symbol |
P -1 |
Hall space group symbol |
-P 1 |
Residual factor for all reflections |
0.0925 |
Residual factor for significantly intense reflections |
0.0487 |
Weighted residual factors for significantly intense reflections |
0.0715 |
Weighted residual factors for all reflections included in the refinement |
0.0821 |
Goodness-of-fit parameter for all reflections included in the refinement |
1.016 |
Diffraction radiation wavelength |
0.71073 Å |
Diffraction radiation type |
MoKα |
Yes |
No |
No |