Information card for entry 7708798
Formula | C11 H5 Ag N6 |
Calculated formula | C11 H5 Ag N6 |
Title of publication | Coordination polymers of 5-substituted 1,2,3,4-tetracyanocyclopentadienides: structural and electrochemical properties of complex compounds of 5-amino- and 5-nitro-tetracyanocyclopentadienide |
Authors of publication | Nimax, Patrick; Rotthowe, Nils; Zoller, Florian; Blockhaus, Tobias; Wagner, Friedrich Ernst; Fattakhova-Rohlfing, Dina; Sünkel, Karlheinz |
Journal of publication | Dalton Transactions |
Year of publication | 2021 |
a | 6.5948 ± 0.0002 Å |
b | 16.304 ± 0.0005 Å |
c | 11.1075 ± 0.0004 Å |
α | 90° |
β | 92.027 ± 0.001° |
γ | 90° |
Cell volume | 1193.55 ± 0.07 Å3 |
Cell temperature | 153 ± 2 K |
Ambient diffraction temperature | 153 ± 2 K |
Number of distinct elements | 4 |
Space group number | 14 |
Hermann-Mauguin space group symbol | P 1 21/n 1 |
Hall space group symbol | -P 2yn |
Residual factor for all reflections | 0.0298 |
Residual factor for significantly intense reflections | 0.0248 |
Weighted residual factors for significantly intense reflections | 0.063 |
Weighted residual factors for all reflections included in the refinement | 0.0672 |
Goodness-of-fit parameter for all reflections included in the refinement | 1.077 |
Diffraction radiation wavelength | 0.71073 Å |
Diffraction radiation type | MoKα |