Information card for entry 7708799
Formula | C9 H2 Ag N5 O3 |
Calculated formula | C9 H2 Ag N5 O3 |
Title of publication | Coordination polymers of 5-substituted 1,2,3,4-tetracyanocyclopentadienides: structural and electrochemical properties of complex compounds of 5-amino- and 5-nitro-tetracyanocyclopentadienide |
Authors of publication | Nimax, Patrick; Rotthowe, Nils; Zoller, Florian; Blockhaus, Tobias; Wagner, Friedrich Ernst; Fattakhova-Rohlfing, Dina; Sünkel, Karlheinz |
Journal of publication | Dalton Transactions |
Year of publication | 2021 |
a | 6.17 ± 0.0003 Å |
b | 10.8301 ± 0.0006 Å |
c | 16.8422 ± 0.0009 Å |
α | 90° |
β | 90° |
γ | 90° |
Cell volume | 1125.42 ± 0.1 Å3 |
Cell temperature | 123 ± 2 K |
Ambient diffraction temperature | 123 ± 2 K |
Number of distinct elements | 5 |
Space group number | 62 |
Hermann-Mauguin space group symbol | P n m a |
Hall space group symbol | -P 2ac 2n |
Residual factor for all reflections | 0.036 |
Residual factor for significantly intense reflections | 0.0279 |
Weighted residual factors for significantly intense reflections | 0.0555 |
Weighted residual factors for all reflections included in the refinement | 0.0617 |
Goodness-of-fit parameter for all reflections included in the refinement | 1.1 |
Diffraction radiation wavelength | 0.71073 Å |
Diffraction radiation type | MoKα |