Information card for entry 7708846
Formula | C14 H14 Cl2 O Pb |
Calculated formula | C14 H14 Cl2 O Pb |
Title of publication | Hypercoordinated eka-tin materials with dangling aryl-methoxy and -methylthio ligands exhibiting intramolecular secondary bonding and aryl bond stabilization in reactions with organotin chlorides. |
Authors of publication | Ornelas, Alfredo; Arias-Ugarte, Renzo; Metta-Magaña, Alejandro J; Sharma, Hemant K.; Pannell, Keith H. |
Journal of publication | Dalton transactions (Cambridge, England : 2003) |
Year of publication | 2021 |
Journal volume | 50 |
Journal issue | 44 |
Pages of publication | 16084 - 16091 |
a | 9.472 ± 0.007 Å |
b | 10.068 ± 0.007 Å |
c | 15.829 ± 0.012 Å |
α | 92.338 ± 0.013° |
β | 92.354 ± 0.013° |
γ | 103.584 ± 0.012° |
Cell volume | 1464.1 ± 1.9 Å3 |
Cell temperature | 296 ± 2 K |
Ambient diffraction temperature | 296 ± 2 K |
Number of distinct elements | 5 |
Space group number | 2 |
Hermann-Mauguin space group symbol | P -1 |
Hall space group symbol | -P 1 |
Residual factor for all reflections | 0.0899 |
Residual factor for significantly intense reflections | 0.0497 |
Weighted residual factors for significantly intense reflections | 0.087 |
Weighted residual factors for all reflections included in the refinement | 0.1077 |
Goodness-of-fit parameter for all reflections included in the refinement | 1.019 |
Diffraction radiation wavelength | 0.71073 Å |
Diffraction radiation type | MoKα |