Information card for entry 7709084
Chemical name | BF4-180 |
Formula | C24 H20 B2 F8 Fe N10 O3 |
Calculated formula | C24 H20 B2 F8 Fe N10 O3 |
SMILES | [Fe]1234([n]5n(ccc5)c5[n]1c(n1[n]2ccc1)cc(c5)C=O)[n]1n(ccc1)c1[n]3c(n2[n]4ccc2)cc(c1)C=O.[B](F)(F)(F)[F-].[B](F)(F)(F)[F-].O |
Title of publication | Thermal and photoinduced spin-crossover of mononuclear FeII complexes based on bppCHO ligand |
Authors of publication | Yang, Qianqian; Meng, Yin-Shan; Liu, Tao; Tang, Jinkui |
Journal of publication | Dalton Transactions |
Year of publication | 2022 |
a | 11.9099 ± 0.0005 Å |
b | 20.2023 ± 0.0008 Å |
c | 12.1694 ± 0.0004 Å |
α | 90° |
β | 90.823 ± 0.001° |
γ | 90° |
Cell volume | 2927.75 ± 0.19 Å3 |
Cell temperature | 180 K |
Ambient diffraction temperature | 180 K |
Number of distinct elements | 7 |
Space group number | 14 |
Hermann-Mauguin space group symbol | P 1 21/n 1 |
Hall space group symbol | -P 2yn |
Residual factor for all reflections | 0.086 |
Residual factor for significantly intense reflections | 0.0679 |
Weighted residual factors for significantly intense reflections | 0.1656 |
Weighted residual factors for all reflections included in the refinement | 0.1868 |
Goodness-of-fit parameter for all reflections included in the refinement | 1.032 |
Diffraction radiation wavelength | 0.71073 Å |
Diffraction radiation type | MoKα |