Information card for entry 7709085
Chemical name | ClO4-340 |
Formula | C24 H18 Cl2 Fe N10 O10 |
Calculated formula | C24 H18 Cl2 Fe N10 O10 |
SMILES | [Fe]1234([n]5n(c6[n]1c(n1[n]2ccc1)cc(c6)C=O)ccc5)[n]1c(n2[n]4ccc2)cc(cc1n1[n]3ccc1)C=O.Cl(=O)(=O)(=O)[O-].Cl(=O)(=O)(=O)[O-] |
Title of publication | Thermal and photoinduced spin-crossover of mononuclear FeII complexes based on bppCHO ligand |
Authors of publication | Yang, Qianqian; Meng, Yin-Shan; Liu, Tao; Tang, Jinkui |
Journal of publication | Dalton Transactions |
Year of publication | 2022 |
a | 18.5932 ± 0.0017 Å |
b | 9.0163 ± 0.0008 Å |
c | 17.4491 ± 0.0017 Å |
α | 90° |
β | 92.848 ± 0.003° |
γ | 90° |
Cell volume | 2921.6 ± 0.5 Å3 |
Cell temperature | 340 K |
Ambient diffraction temperature | 340 K |
Number of distinct elements | 6 |
Space group number | 14 |
Hermann-Mauguin space group symbol | P 1 21/c 1 |
Hall space group symbol | -P 2ybc |
Residual factor for all reflections | 0.1026 |
Residual factor for significantly intense reflections | 0.0584 |
Weighted residual factors for significantly intense reflections | 0.1419 |
Weighted residual factors for all reflections included in the refinement | 0.186 |
Goodness-of-fit parameter for all reflections included in the refinement | 1.108 |
Diffraction radiation wavelength | 0.71073 Å |
Diffraction radiation type | MoKα |