Information card for entry 7709320
Formula | C28 H44 O2 P2 Pt S |
Calculated formula | C28 H44 O2 P2 Pt S |
SMILES | [Pt]12([P](Oc3c2c(O[P]1(C(C)(C)C)C(C)(C)C)ccc3)(C(C)(C)C)C(C)(C)C)Sc1ccccc1 |
Title of publication | Platinum thiolate complexes supported by PBP and POCOP pincer ligands as efficient catalysts for the hydrosilylation of carbonyl compounds |
Authors of publication | Xue, Man-Man; Chang, Jiarui; Zhang, Jie; Chen, Xuenian |
Journal of publication | Dalton Transactions |
Year of publication | 2022 |
a | 12.7901 ± 0.0001 Å |
b | 12.6583 ± 0.0002 Å |
c | 20.848 ± 0.0002 Å |
α | 90° |
β | 106.518 ± 0.001° |
γ | 90° |
Cell volume | 3236.01 ± 0.07 Å3 |
Cell temperature | 169.99 ± 0.1 K |
Ambient diffraction temperature | 169.99 ± 0.1 K |
Number of distinct elements | 6 |
Space group number | 14 |
Hermann-Mauguin space group symbol | P 1 21/n 1 |
Hall space group symbol | -P 2yn |
Residual factor for all reflections | 0.0354 |
Residual factor for significantly intense reflections | 0.0327 |
Weighted residual factors for significantly intense reflections | 0.0887 |
Weighted residual factors for all reflections included in the refinement | 0.0902 |
Goodness-of-fit parameter for all reflections included in the refinement | 1.074 |
Diffraction radiation probe | x-ray |
Diffraction radiation wavelength | 1.54184 Å |
Diffraction radiation type | CuKα |