Information card for entry 7709549
Formula | C24 H22 Br4 Cu N7 O7 |
Calculated formula | C24 H22 Br4 Cu N7 O7 |
SMILES | [Cu]12([n]3c(cccc3Br)N[N]2=Cc2cc(Br)ccc2O)[n]2c(N[N]1=Cc1cc(Br)ccc1O)cccc2Br.N(=O)(=O)[O-].O.O |
Title of publication | Discovery of thirteen cobalt (II) and copper (II) salicylaldehyde Schiff base complexes that induce apoptosis and autophagy in human lung adenocarcinoma A549/DDP cells and that can overcome cisplatin resistance in vitro and in vivo |
Authors of publication | Chen, Yating; Zhang, Shaonan; Wang, Zhen-Feng; Wei, Qingmin; Zhang, Shuhua |
Journal of publication | Dalton Transactions |
Year of publication | 2022 |
a | 23.2906 ± 0.0018 Å |
b | 7.2893 ± 0.0005 Å |
c | 22.5828 ± 0.0017 Å |
α | 90° |
β | 124.599 ± 0.011° |
γ | 90° |
Cell volume | 3155.9 ± 0.6 Å3 |
Cell temperature | 298 ± 2 K |
Ambient diffraction temperature | 298 ± 2 K |
Number of distinct elements | 6 |
Space group number | 5 |
Hermann-Mauguin space group symbol | C 1 2 1 |
Hall space group symbol | C 2y |
Residual factor for all reflections | 0.0754 |
Residual factor for significantly intense reflections | 0.0544 |
Weighted residual factors for significantly intense reflections | 0.1384 |
Weighted residual factors for all reflections included in the refinement | 0.1592 |
Goodness-of-fit parameter for all reflections included in the refinement | 1.007 |
Diffraction radiation wavelength | 0.71073 Å |
Diffraction radiation type | MoKα |