Information card for entry 7709550
Formula | C70 H63 Cl3 Cu3 N18 O11 |
Calculated formula | C70 H63 Cl3 Cu3 N18 O11 |
Title of publication | Discovery of thirteen cobalt (II) and copper (II) salicylaldehyde Schiff base complexes that induce apoptosis and autophagy in human lung adenocarcinoma A549/DDP cells and that can overcome cisplatin resistance in vitro and in vivo |
Authors of publication | Chen, Yating; Zhang, Shaonan; Wang, Zhen-Feng; Wei, Qingmin; Zhang, Shuhua |
Journal of publication | Dalton Transactions |
Year of publication | 2022 |
a | 20.5906 ± 0.0005 Å |
b | 12.324 ± 0.0002 Å |
c | 28.4849 ± 0.0006 Å |
α | 90° |
β | 106.204 ± 0.002° |
γ | 90° |
Cell volume | 6941.1 ± 0.3 Å3 |
Cell temperature | 100 ± 2 K |
Ambient diffraction temperature | 100 ± 2 K |
Number of distinct elements | 6 |
Space group number | 14 |
Hermann-Mauguin space group symbol | P 1 21/c 1 |
Hall space group symbol | -P 2ybc |
Residual factor for all reflections | 0.078 |
Residual factor for significantly intense reflections | 0.0504 |
Weighted residual factors for significantly intense reflections | 0.1185 |
Weighted residual factors for all reflections included in the refinement | 0.1319 |
Goodness-of-fit parameter for all reflections included in the refinement | 1.002 |
Diffraction radiation wavelength | 1.3415 Å |
Diffraction radiation type | GaKα |