Information card for entry 7709552
Formula | C48 H33 Br4 Cl4 Co2 N12 O4.5 |
Calculated formula | C48 H33 Br4 Cl4 Co2 N12 O4.5 |
Title of publication | Discovery of thirteen cobalt (II) and copper (II) salicylaldehyde Schiff base complexes that induce apoptosis and autophagy in human lung adenocarcinoma A549/DDP cells and that can overcome cisplatin resistance in vitro and in vivo |
Authors of publication | Chen, Yating; Zhang, Shaonan; Wang, Zhen-Feng; Wei, Qingmin; Zhang, Shuhua |
Journal of publication | Dalton Transactions |
Year of publication | 2022 |
a | 10.0668 ± 0.0008 Å |
b | 12.2845 ± 0.0007 Å |
c | 13.5174 ± 0.0008 Å |
α | 63.376 ± 0.006° |
β | 71.616 ± 0.006° |
γ | 79.004 ± 0.005° |
Cell volume | 1415.71 ± 0.18 Å3 |
Cell temperature | 298 ± 2 K |
Ambient diffraction temperature | 293 ± 2 K |
Number of distinct elements | 7 |
Space group number | 2 |
Hermann-Mauguin space group symbol | P -1 |
Hall space group symbol | -P 1 |
Residual factor for all reflections | 0.0754 |
Residual factor for significantly intense reflections | 0.0544 |
Weighted residual factors for significantly intense reflections | 0.1246 |
Weighted residual factors for all reflections included in the refinement | 0.138 |
Goodness-of-fit parameter for all reflections included in the refinement | 0.991 |
Diffraction radiation wavelength | 0.71073 Å |
Diffraction radiation type | MoKα |